Target
Epoxide hydrolase
Ligand
BDBM25745
Substrate
Meas. Tech.
Inhibition Assay
IC50
30.0±n/a nM
Citation
 Guedes, AGHammock, BDMorisseau, C Treatment of inflammatory disorders in non-human mammals US Patent  US10383835 Publication Date 8/20/2019 
Target
Name:
Epoxide hydrolase
Synonyms:
EPHX1
Type:
Enzyme
Mol. Mass.:
52112.47
Organism:
Ovis aries (Sheep)
Description:
W5Q7Q6
Residue:
451
  
Inhibitor
Name:
BDBM25745
Synonyms:
3-(1-methanesulfonylpiperidin-4-yl)-1-[4-(trifluoromethoxy)phenyl]urea US9296693, 55 | Urea-based compound, 26
Type:
Small organic molecule
Emp. Form.:
C14H18F3N3O4S
Mol. Mass.:
381.371
SMILES:
CS(=O)(=O)N1CCC(CC1)NC(=O)Nc1ccc(OC(F)(F)F)cc1
: