Target
Epoxide hydrolase
Ligand
BDBM50327809
Substrate
Meas. Tech.
Inhibition Assay
IC50
68.0±n/a nM
Citation
 Guedes, AGHammock, BDMorisseau, C Treatment of inflammatory disorders in non-human mammals US Patent  US10383835 Publication Date 8/20/2019 
Target
Name:
Epoxide hydrolase
Synonyms:
EPHX1
Type:
Enzyme
Mol. Mass.:
48577.06
Organism:
Equus caballus (Horse)
Description:
A0A5F5PR84
Residue:
462
  
Inhibitor
Name:
BDBM50327809
Synonyms:
1-(1-Propionylpiperidin-4-yl)-3-(4-(trifluoromethoxy)phenyl)urea US10383835, Compound 1770 US9296693, 40
Type:
Small organic molecule
Emp. Form.:
C16H20F3N3O3
Mol. Mass.:
359.3435
SMILES:
CCC(=O)N1CCC(CC1)NC(=O)Nc1ccc(OC(F)(F)F)cc1
: