Target
Integrase
Ligand
BDBM294739
Substrate
Meas. Tech.
Anti-HIV Activity MT4 Assay
IC50
3.00±n/a nM
Citation
 Johns, BAVelthuisen, EJWeatherhead, JGSuwandi, LTemelkoff, D Isoindoline derivatives for use in the treatment of a viral infection US Patent  US10112899 Publication Date 10/30/2018 
Target
Name:
Integrase
Synonyms:
Human immunodeficiency virus type 1 integrase
Type:
PROTEIN
Mol. Mass.:
32231.48
Organism:
Human immunodeficiency virus 1
Description:
ChEMBL_90865
Residue:
288
  
Inhibitor
Name:
BDBM294739
Synonyms:
(S)-2-(tert-butoxy)-2-((M)-2-(4,4-difluoropiperidine-1-carbon yl)-6-(8-fluoro-5-methylchroman-6-yl)-4,7-dimethylisoindolin-5-yl)acetic acid | US10112899, Example 213
Type:
Small organic molecule
Emp. Form.:
C32H39F3N2O5
Mol. Mass.:
588.6577
SMILES:
Cc1c2CN(Cc2c(C)c(-c2cc(F)c3OCCCc3c2C)c1[C@H](OC(C)(C)C)C(O)=O)C(=O)N1CCC(F)(F)CC1
: