Target
N-formyl peptide receptor 2
Ligand
BDBM350568
Substrate
Meas. Tech.
FLIPR
EC50
2.50±n/a nM
Citation
 Viswanath, VBeard, RLDonello, JEHsia, E Use of agonists of formyl peptide receptor 2 for treating dermatological diseases US Patent  US10434112 Publication Date 10/8/2019 
Target
Name:
N-formyl peptide receptor 2
Synonyms:
ALXR, FPRL1, FPR2 FPR2 FPRH1 Formyl Peptide Receptor-Like 1 LXA4 receptor Lipoxin A4 receptor RFP | hFPRL
Type:
G Protein-Coupled Receptor (GPCR)
Mol. Mass.:
38968.35
Organism:
Homo sapiens (Human)
Description:
P25090
Residue:
351
  
Inhibitor
Name:
BDBM350568
Synonyms:
N-(4-bromophenyl) spiro[bicyclo[2.2.1]heptane- 7,1'-cyclopropane]-2,3- dicarboxamide US10434112, Compound 45 | US10799518, Compound 45
Type:
Small organic molecule
Emp. Form.:
C17H19BrN2O2
Mol. Mass.:
363.249
SMILES:
NC(=O)C1C2CCC(C1C(=O)Nc1ccc(Br)cc1)C21CC1
: