Target
Isocitrate dehydrogenase [NADP] cytoplasmic [R132H]
Ligand
BDBM247579
Substrate
Meas. Tech.
Fluorescence Biochemical Assay
pH
7.5±n/a
Temperature
298.15±n/a K
IC50
2700±n/a nM
Comments
extracted
Citation
 Caferro, TRChen, ZCho, YSCostales, AQLevell, JRLiu, GManning, JRSendzik, MShafer, CShultz, MDSutton, JCWang, YZhao, Q 3-pyrimidin-4-yl-oxazolidin-2-ones as inhibitors of mutant IDH US Patent  US10112931 Publication Date 10/30/2018 
Target
Name:
Isocitrate dehydrogenase [NADP] cytoplasmic [R132H]
Synonyms:
Cytosolic NADP-isocitrate dehydrogenase (IDH1)(R132H) IDH1 R132H IDHC_HUMAN Isocitrate dehydrogenase 1 mutant (R132H) Isocitrate dehydrogenase [NADP] cytoplasmic (IDH1)(R132H) PICD
Type:
Protein
Mol. Mass.:
46641.74
Organism:
Homo sapiens (Human)
Description:
Human IDH1 R132H (SEQ ID No. 2 in patent). First three are removed. Google patent parsed wrong.
Residue:
414
  
Inhibitor
Name:
BDBM247579
Synonyms:
US10112931, Example 157 US9688672, Example 157
Type:
Small organic molecule
Emp. Form.:
C20H18ClF3N6O4
Mol. Mass.:
498.843
SMILES:
C[C@@H](O)[C@H]1COC(=O)N1c1ccnc(NC(C)c2nc(no2)-c2ccc(Cl)cc2C(F)(F)F)n1
: