Target
Phosphatidylinositol 3-kinase regulatory subunit alpha
Ligand
BDBM295675
Substrate
Meas. Tech.
p110alpha (Alpha) PI3K Binding Assay
Ki
<0.020±n/a nM
Citation
 Braun, MHanan, EStaben, STHeald, RAMacLeod, CElliott, R Benzoxazepin oxazolidinone compounds and methods of use US Patent  US10112932 Publication Date 10/30/2018 
Target
Name:
Phosphatidylinositol 3-kinase regulatory subunit alpha
Synonyms:
GRB1 PI3-kinase class I PI3-kinase p85-alpha subunit PI3-kinase subunit p85-alpha PIK3CG/PIK3R1 Phosphatidylinositol 3-kinase 85 kDa regulatory subunit alpha (PI3K alpha) Phosphatidylinositol 3-kinase regulatory subunit alpha (PIK3R1) Phosphatidylinositol 3-kinase regulatory subunit alpha isoform 1 (PI3 Kinase alpha) Phosphatidylinositol 4,5-bisphosphate 3-kinase catalytic subunit alpha isoform (PI3Kalpha) PtdIns-3-kinase p85-alpha p85 alpha
Type:
Protein
Mol. Mass.:
83592.82
Organism:
Homo sapiens (Human)
Description:
P27986
Residue:
724
  
Inhibitor
Name:
BDBM295675
Synonyms:
US10851091, U.S. Pat. No. 8,242,104 No. 469 | US8242104, Compound 469
Type:
Small organic molecule
Emp. Form.:
C20H20F3N7O2
Mol. Mass.:
447.4137
SMILES:
NC(=O)[C@@H]1CCCN1c1ccc2-c3nc(cn3CCOc2c1)-c1ncnn1CC(F)(F)F
: