Target
P2X purinoceptor 7
Ligand
BDBM254320
Substrate
Meas. Tech.
Radioligand Binding
Ki
1.20±n/a nM
Citation
 Alcazar Vaca, MJAllison, BDAndres Gil, JIChrovian, CCCoate, HRDe Angelis, MDeng, XDvorak, CAGelin, CFLetavic, MALiang, JTMani, NSRech, JCSavall, BMSoyode-Johnson, AStenne, BMSwanson, DMWall, JL P2X7 modulators and methods of use US Patent  US10112937 Publication Date 10/30/2018 
Target
Name:
P2X purinoceptor 7
Synonyms:
ATP receptor P2X purinoceptor 7 P2X purinoceptor 7 (P2X7) P2X7 rat P2rx7 | Purinergic receptor
Type:
Protein
Mol. Mass.:
68403.50
Organism:
Rattus norvegicus (Rat)
Description:
Q64663
Residue:
595
  
Inhibitor
Name:
BDBM254320
Synonyms:
US10112937, Example 220 US10703749, Example 220 | US9464084, 220
Type:
Small organic molecule
Emp. Form.:
C18H13F5N6O
Mol. Mass.:
424.3274
SMILES:
C[C@H]1Cc2c(CN1C(=O)c1cccc(c1F)C(F)(F)F)nnn2-c1ncc(F)cn1
: