Target
Cyclin-dependent kinase 4/G1/S-specific cyclin-D1
Ligand
BDBM6859
Substrate
Rb(21)
Meas. Tech.
Kinase Inhibition Assay
pH
7±n/a
Temperature
295.15±n/a K
IC50
4400±n/a nM
Citation
 Zhu, GConner, SEZhou, XShih, CLi, TAnderson, BDBrooks, HBCampbell, RMConsidine, EDempsey, JAFaul, MMOgg, CPatel, BSchultz, RMSpencer, CDTeicher, BWatkins, SA Synthesis, structure-activity relationship, and biological studies of indolocarbazoles as potent cyclin D1-CDK4 inhibitors. J Med Chem 46:2027-30 (2003)  
Target
Name:
Cyclin-dependent kinase 4/G1/S-specific cyclin-D1
Synonyms:
CDK4/CycD CDK4/Cyclin D1 Cyclin-Dependent Kinase 4 (CDK4) Cyclin-dependent kinase 4/G1/S-specific cyclin D1 | Cyclin-dependent kinase 4/cyclin D1
Type:
Protein Complex
Mol. Mass.:
Description:
CDK4/D1 complexes were purified from insect cells co-infected with baculovirus vectors containing each of the components.
Components:
This complex has 2 components.
Component 1
Name:
Cyclin-dependent kinase 4
Synonyms:
CDK4 Cell division protein kinase 4 PSK-J3
Type:
Enzyme Subunit
Mol. Mass.:
33731.96
Organism:
Homo sapiens (Human)
Description:
P11802
Residue:
303
  
Component 2
Name:
G1/S-specific cyclin-D1
Synonyms:
B-cell lymphoma 1 protein BCL-1 oncogene CCND1 PRAD1 | PRAD1 oncogene
Type:
Enzyme Subunit
Mol. Mass.:
33717.70
Organism:
Homo sapiens (Human)
Description:
Residue:
295
  
Inhibitor
Name:
BDBM6859
Synonyms:
7-bromo-3,13,23-triazahexacyclo[14.7.0.0^{2,10}.0^{4,9}.0^{11,15}.0^{17,22}]tricosa-1(16),2(10),4(9),5,7,11(15),17(22),18,20-nonaene-12,14-dione | Indolocarbazole deriv. 4(c)
Type:
Small Organic Molecule
Emp. Form.:
C20H10BrN3O2
Mol. Mass.:
404.216
SMILES:
Brc1ccc2[nH]c3c4[nH]c5ccccc5c4c4C(=O)NC(=O)c4c3c2c1
:
Substrate
Name:
Rb(21)
Synonyms:
C-terminal retinoblastoma protein RB_HUMAN
Type:
Other Protein Type
Mol. Mass.:
17129.60
Organism:
Homo sapiens (Human)
Description:
Amino acids 769-921 of human retinoblastoma 1.
Residue:
153