Target
Cyclin-dependent kinase/G2/mitotic-specific cyclin- 1
Ligand
BDBM6860
Substrate
Histone H1
Meas. Tech.
Kinase Inhibition Assay
Temperature
298.15±n/a K
IC50
2100±n/a nM
Comments
extracted
Citation
 Zhu, GConner, SEZhou, XShih, CLi, TAnderson, BDBrooks, HBCampbell, RMConsidine, EDempsey, JAFaul, MMOgg, CPatel, BSchultz, RMSpencer, CDTeicher, BWatkins, SA Synthesis, structure-activity relationship, and biological studies of indolocarbazoles as potent cyclin D1-CDK4 inhibitors. J Med Chem 46:2027-30 (2003)  
Target
Name:
Cyclin-dependent kinase/G2/mitotic-specific cyclin- 1
Synonyms:
CDK1/B CDK1/CyclinB Cyclin-Dependent Kinase 1 (CDK1) Cyclin-dependent kinase/G2/mitotic-specific cyclin 1 | cdk1
Type:
Protein Complex
Mol. Mass.:
Description:
CDK1/Cyclin B complexes were purified from insect cells co-infected with baculovirus vectors containing each of the components.
Components:
This complex has 2 components.
Component 1
Name:
Cyclin-dependent kinase 1
Synonyms:
CDC2 CDK1 CDKN1 Cell division protein kinase 1 P34CDC2 | p34 protein kinase
Type:
Enzyme Subunit
Mol. Mass.:
34101.08
Organism:
Homo sapiens (Human)
Description:
P06493
Residue:
297
  
Component 2
Name:
G2/mitotic-specific cyclin-B1
Synonyms:
CCNB CCNB1_HUMAN
Type:
Enzyme Subunit
Mol. Mass.:
48340.95
Organism:
Homo sapiens (Human)
Description:
P14635
Residue:
433
  
Inhibitor
Name:
BDBM6860
Synonyms:
6-bromo-3,13,23-triazahexacyclo[14.7.0.0^{2,10}.0^{4,9}.0^{11,15}.0^{17,22}]tricosa-1(16),2(10),4(9),5,7,11(15),17(22),18,20-nonaene-12,14-dione | Indolocarbazole deriv. 4(d)
Type:
Small Organic Molecule
Emp. Form.:
C20H10BrN3O2
Mol. Mass.:
404.216
SMILES:
Brc1ccc2c(c1)[nH]c1c3[nH]c4ccccc4c3c3C(=O)NC(=O)c3c21
:
Substrate
Name:
Histone H1
Synonyms:
Type:
Other Protein Type
Mol. Mass.:
358.43
Organism:
Bos taurus (bovine)
Description:
Residue:
3
NA