Target
Trace amine-associated receptor 1
Ligand
BDBM250210
Substrate
Meas. Tech.
Radioligand Binding Assay
Ki
0.400±n/a nM
Citation
 Groebke Zbinden, KNorcross, RPflieger, P Substituted benzamides US Patent  US10501411 Publication Date 12/10/2019 
Target
Name:
Trace amine-associated receptor 1
Synonyms:
TAAR1_MOUSE Taar1 Trace amine receptor 1 (TARR1) Trace amine-associated receptor1 | Trar1
Type:
Protein
Mol. Mass.:
37635.41
Organism:
Mus musculus (Mouse)
Description:
Q923Y8
Residue:
332
  
Inhibitor
Name:
BDBM250210
Synonyms:
US10501411, Example 120 US9452980, 120
Type:
Small organic molecule
Emp. Form.:
C19H21ClN2O2
Mol. Mass.:
344.835
SMILES:
Clc1ccc(CCOC(=O)Nc2ccc(cc2)C2CCNC2)cc1
: