Target
cAMP-dependent protein kinase catalytic subunit alpha
Ligand
BDBM6866
Substrate
PKA Peptide Substrate
Meas. Tech.
Kinase Inhibition Assay
IC50
>100000±n/a nM
Citation
 Lin, RConnolly, PJHuang, SWetter, SKLu, YMurray, WVEmanuel, SLGruninger, RHFuentes-Pesquera, ARRugg, CAMiddleton, SAJolliffe, LK 1-Acyl-1H-[1,2,4]triazole-3,5-diamine analogues as novel and potent anticancer cyclin-dependent kinase inhibitors: synthesis and evaluation of biological activities. J Med Chem 48:4208-11 (2005)  
Target
Name:
cAMP-dependent protein kinase catalytic subunit alpha
Synonyms:
KAPCA_BOVIN PKC Protein Kinase C cAMP-Dependent Protein Kinase (PKA) cAMP-dependent protein kinase A cAMP-dependent protein kinase, alpha-catalytic subunit
Type:
Enzyme Complex
Mol. Mass.:
40627.77
Organism:
Bos taurus (bovine)
Description:
The PKA holoenzyme purified from bovine heart, exists as an inactive tetrameric complex, which consists of a regulatory dimer associated with two catalytic subunits. It requires cAMP to activate the enzymatic reaction.
Residue:
351
  
Inhibitor
Name:
BDBM6866
Synonyms:
1-Acyl-1H-[1,2,4]triazole-3,5-diamine Analogue 3b 4-[[5-Amino-1-(2,6-difluorobenzoyl)-1H-1,2,4-triazol-3-yl]amino]-benzenesulfonamide JNJ-7706621 | cid_5330790
Type:
Small organic molecule
Emp. Form.:
C15H12F2N6O3S
Mol. Mass.:
394.356
SMILES:
Nc1nc(Nc2ccc(cc2)S(N)(=O)=O)nn1C(=O)c1c(F)cccc1F
:
Substrate
Name:
PKA Peptide Substrate
Synonyms:
Type:
Peptide
Mol. Mass.:
2018.28
Organism:
Description:
Residue:
18
ITINGRTGRRNSIAMIDE