Target
Casein kinase I isoform delta
Ligand
BDBM6867
Substrate
CK1 Peptide Substrate
Meas. Tech.
Kinase Inhibition Assay
IC50
>100000±n/a nM
Citation
 Lin, RConnolly, PJHuang, SWetter, SKLu, YMurray, WVEmanuel, SLGruninger, RHFuentes-Pesquera, ARRugg, CAMiddleton, SAJolliffe, LK 1-Acyl-1H-[1,2,4]triazole-3,5-diamine analogues as novel and potent anticancer cyclin-dependent kinase inhibitors: synthesis and evaluation of biological activities. J Med Chem 48:4208-11 (2005)  
Target
Name:
Casein kinase I isoform delta
Synonyms:
CK1, delta Casein kinase I delta Csnk1d KC1D_RAT | casein kinase 1, delta
Type:
Enzyme
Mol. Mass.:
47342.73
Organism:
Rattus norvegicus (rat)
Description:
Q06486
Residue:
415
  
Inhibitor
Name:
BDBM6867
Synonyms:
1-Acyl-1H-[1,2,4]triazole-3,5-diamine Analogue 3c 4-[[5-Amino-1-(2,6-difluoro-3-methylbenzoyl)-1H-1,2,4-triazol-3-yl]amino]-benzenesulfonamide
Type:
Small organic molecule
Emp. Form.:
C16H14F2N6O3S
Mol. Mass.:
408.383
SMILES:
Cc1ccc(F)c(C(=O)n2nc(Nc3ccc(cc3)S(N)(=O)=O)nc2N)c1F
:
Substrate
Name:
CK1 Peptide Substrate
Synonyms:
Type:
Peptide
Mol. Mass.:
3083.59
Organism:
Description:
Residue:
28