Target
RAC-alpha serine/threonine-protein kinase
Ligand
BDBM430065
Substrate
Meas. Tech.
QSS Assist FP assay
IC50
0.400±n/a nM
Citation
 Sugimoto, TSakamoto, TYamamoto, FKobayakawa, YEgashira, NIchikawa, KMachida, T 5H-pyrrolo[2,3-D]pyrimidin-6(7H)-one derivative US Patent  US10538528 Publication Date 1/21/2020 
Target
Name:
RAC-alpha serine/threonine-protein kinase
Synonyms:
AKT phosphorylation (p-AKT) AKT1/PPP1CA C-AKT PKB alpha Protein kinase B Protein kinase B (Akt 1) Protein kinase B alpha Proto-oncogene Akt (Akt1) Proto-oncogene c-Akt (AKT1) RAC-PK-alpha RAC-alpha serine/threonine-protein kinase (AKT1) | RAC-alpha serine/threonine-protein kinase (pAKT)
Type:
Enzyme
Mol. Mass.:
55681.25
Organism:
Homo sapiens (Human)
Description:
P31749
Residue:
480
  
Inhibitor
Name:
BDBM430065
Synonyms:
US10538528, Compound 35
Type:
Small organic molecule
Emp. Form.:
C26H30F3N9O2
Mol. Mass.:
557.5707
SMILES:
CC1(C)C(=O)Nc2ncnc(N3CCC(CC3)c3nc(ccc3NCC3CCCN3)-c3nnc(o3)C(F)(F)F)c12
: