Target
Sodium channel protein type 2 subunit alpha
Ligand
BDBM432084
Substrate
Meas. Tech.
Automated patch clamp (Inactivation State Block)
IC50
100.0±n/a nM
Citation
 Williams, SJJarrott, B Sodium channel modulators US Patent  US10577308 Publication Date 3/3/2020 
Target
Name:
Sodium channel protein type 2 subunit alpha
Synonyms:
HBSC II SCN2A SCN2A2 Sodium (Site 2) Sodium channel protein type 2 alpha subunit Voltage-gated sodium channel subunit alpha Nav1.2
Type:
Enzyme
Mol. Mass.:
227954.68
Organism:
Homo sapiens (Human)
Description:
Q99250
Residue:
2005
  
Inhibitor
Name:
BDBM432084
Synonyms:
US10577308, Compound 562
Type:
Small organic molecule
Emp. Form.:
C22H25N3O
Mol. Mass.:
347.4534
SMILES:
Cc1cccc(C)c1OCCCNC(c1ccccn1)c1ccccn1
: