Target
Somatostatin receptor type 4
Ligand
BDBM275998
Substrate
Meas. Tech.
Camp Assay
EC50
3.70±n/a nM
Citation
 Mazzaferro, RFerrara, MGiovannini, RLingard, IRudolf, K Morpholine and 1,4-oxazepane amides as somatostatin receptor subtype 4 (SSTR4) agonists US Patent  US10577336 Publication Date 3/3/2020 
Target
Name:
Somatostatin receptor type 4
Synonyms:
SOMATOSTATIN SST4 SS4-R SSR4_HUMAN SSTR4 | Somatostatin receptor type 4 (SSTR4)
Type:
Enzyme
Mol. Mass.:
42015.38
Organism:
Homo sapiens (Human)
Description:
P31391
Residue:
388
  
Inhibitor
Name:
BDBM275998
Synonyms:
US10071974, Example 109 | US10577336, Example 109
Type:
Small organic molecule
Emp. Form.:
C17H23N3O2
Mol. Mass.:
301.3834
SMILES:
Cc1cccn2c(ccc12)C(C)(C)NC(=O)[C@@H]1CNCCO1
: