Target
Interleukin-1 receptor-associated kinase 4
Ligand
BDBM374430
Substrate
Meas. Tech.
Biochemical Assay
IC50
550±n/a nM
Citation
 Chan, TGuckian, KJenkins, TThomas, JVessels, JKumaravel, GMeissner, RLyssikatos, JLucas, BLeaf, IDuffield, J IRAK4 inhibiting agents US Patent  US10577367 Publication Date 3/3/2020 
Target
Name:
Interleukin-1 receptor-associated kinase 4
Synonyms:
IRAK-4 IRAK4_HUMAN Interleukin-1 receptor-associated kinase 4 (IRAK4) | Renal carcinoma antigen NY-REN-64
Type:
Protein
Mol. Mass.:
51519.08
Organism:
Homo sapiens (Human)
Description:
Q9NWZ3
Residue:
460
  
Inhibitor
Name:
BDBM374430
Synonyms:
5-(1-(4-methylpyridin-2-yl)-1H-indazol-6-yl)pyridin-3-amine US10577367, Example 39
Type:
Small organic molecule
Emp. Form.:
C18H15N5
Mol. Mass.:
301.3452
SMILES:
Cc1ccnc(c1)-n1ncc2ccc(cc12)-c1cncc(N)c1
: