Target
Metabotropic glutamate receptor 5
Ligand
BDBM50113473
Substrate
Meas. Tech.
[3H]-M-MPEP Radioligand Binding Assay
Ki
1.23±n/a nM
Citation
 Christopher, JACongreve, MSAves, SJTehan, BG 4-(3-cyanophenyl)-6-pyridinylpyrimidine mGlu5 modulators US Patent  US10584111 Publication Date 3/10/2020 
Target
Name:
Metabotropic glutamate receptor 5
Synonyms:
GPRC1E GRM5_HUMAN metabotropic glutamate 5 | metabotropic glutamate 5a
Type:
Enzyme
Mol. Mass.:
132484.72
Organism:
Homo sapiens (Human)
Description:
Residue:
1212
  
Inhibitor
Name:
BDBM50113473
Synonyms:
CHEMBL3603920 US10584111, Ex No. 1 | US11584732, Example 1
Type:
Small organic molecule
Emp. Form.:
C16H8ClFN4
Mol. Mass.:
310.713
SMILES:
Fc1c(Cl)cc(cc1-c1cc(ncn1)-c1ccccn1)C#N
: