Target
Kappa-type opioid receptor
Ligand
BDBM298148
Substrate
Meas. Tech.
enzyme assay
IC50
57.0±n/a nM
Citation
 Roberts, EGuerrero, MAUrbano, MRosen, H Kappa opioid ligands US Patent  US10118915 Publication Date 11/6/2018 
Target
Name:
Kappa-type opioid receptor
Synonyms:
K-OR-1 Kappa-opioid receptor (KOR) Kappa-type opioid receptor (KOR) OPIATE Kappa OPRK1 kappa opioid receptor (KOR)
Type:
G Protein-Coupled Receptor (GPCR)
Mol. Mass.:
42648.76
Organism:
Homo sapiens (Human)
Description:
P41145
Residue:
380
  
Inhibitor
Name:
BDBM298148
Synonyms:
US10118915, Compound 408
Type:
Small organic molecule
Emp. Form.:
C19H32N4O3
Mol. Mass.:
364.4824
SMILES:
COC1CN(CCC1NCC(C)C)c1nnc(C)cc1C(=O)OC(C)C
: