Target
Tissue-type plasminogen activator
Ligand
BDBM298009
Substrate
Meas. Tech.
Plasma-based Clot Lysis Assay
IC50
9.70±n/a nM
Citation
 Ellermann, MValot, GCancho Grande, YHaßfeld, JKinzel, TKöbberling, JBeyer, KRöhrig, SSperzel, MStampfuß, JMeyer, IKöllnberger, MBurkhardt, NSchlemmer, KStegmann, CSchuhmacher, JWerner, MHeiermann, JHengeveld, WJ Piperidinylpyrazolopyrimidinones and their use US Patent  US10118930 Publication Date 11/6/2018 
Target
Name:
Tissue-type plasminogen activator
Synonyms:
Alteplase Reteplase Thrombin receptor protein Tissue-type plasminogen activator (tPA) t-PA t-plasminogen activator
Type:
Enzyme
Mol. Mass.:
62931.08
Organism:
Homo sapiens (Human)
Description:
Residue:
562
  
Inhibitor
Name:
BDBM298009
Synonyms:
3-[3-(4-fluorobenzyl)-1,2,4-oxadiazol-5-yl]-7-(piperidin-4-yl)pyrazolo[1,5-a]pyrimidin-5(4H)-one hydrochloride | US10118930, Example 224
Type:
Small organic molecule
Emp. Form.:
C20H19FN6O2
Mol. Mass.:
394.4023
SMILES:
Fc1ccc(Cc2noc(n2)-c2cnn3c(cc(=O)[nH]c23)C2CCNCC2)cc1
: