Target
Neprilysin
Ligand
BDBM50034865
Substrate
Meas. Tech.
Enzyme NEP Inhibition Assay
IC50
700±n/a nM
Citation
 Hughes, ADFenster, EFleury, MGendron, RMoran, EJ Neprilysin inhibitors US Patent  US10123984 Publication Date 11/13/2018 
Target
Name:
Neprilysin
Synonyms:
Atriopeptidase CD_antigen=CD10 EPN MME NEP_HUMAN Neutral endopeptidase | Neutral endopeptidase 24.11
Type:
Enzyme
Mol. Mass.:
85505.38
Organism:
Homo sapiens (Human)
Description:
P08473
Residue:
750
  
Inhibitor
Name:
BDBM50034865
Synonyms:
(2S,4S)-5-Biphenyl-4-yl-4-(3-carboxy-propionylamino)-2-methyl-pentanoic acid US10123984, Compound 21c(R,R) | US20230285340, Compound 21d (S,S)
Type:
Small organic molecule
Emp. Form.:
C22H25NO5
Mol. Mass.:
383.4376
SMILES:
C[C@@H](C[C@@H](Cc1ccc(cc1)-c1ccccc1)NC(=O)CCC(O)=O)C(O)=O
: