Target
Toll-like receptor 9
Ligand
BDBM444221
Substrate
Meas. Tech.
Inhibition Reporter Assay
IC50
23.0±n/a nM
Citation
 Dyckman, AJDodd, DSHaque, TSLombardo, LJMacor, JEMussari, CPPasunoori, LPoss, MAKumar, SRPosy, SLTortolani, DRWhiteley, BKSistla, RKHegde, SRamachandra Reddy, AK Pyridyl substituted indole compounds US Patent  US10660877 Publication Date 5/26/2020 
Target
Name:
Toll-like receptor 9
Synonyms:
CD_antigen: CD289 TLR9_HUMAN
Type:
Enzyme
Mol. Mass.:
115889.91
Organism:
Homo sapiens (Human)
Description:
Q9NR96
Residue:
1032
  
Inhibitor
Name:
BDBM444221
Synonyms:
US10660877, Example 811
Type:
Small organic molecule
Emp. Form.:
C28H38N4
Mol. Mass.:
430.6281
SMILES:
CC(C)N1CCC(CC1)N1CCC(CC1)c1ccc2[nH]c(c(C)c2c1)-c1ccnc(C)c1
: