Target
Fibroblast growth factor receptor 2
Ligand
BDBM161419
Substrate
Meas. Tech.
FGFR2 Kinase Activity
IC50
0.400±n/a nM
Citation
 Sootome, H Therapeutic agent for FGFR inhibitor-resistant cancer US Patent  US10124003 Publication Date 11/13/2018 
Target
Name:
Fibroblast growth factor receptor 2
Synonyms:
BEK FGFR-2 FGFR2 Fibroblast growth factor receptor 2 (FGFR2) KGFR Keratinocyte growth factor receptor VEGF-receptor 2 and Fibroblast growth factor receptor 2
Type:
Enzyme
Mol. Mass.:
92015.45
Organism:
Homo sapiens (Human)
Description:
P21802
Residue:
821
  
Inhibitor
Name:
BDBM161419
Synonyms:
US10124003, Ex. Compound 32 US10894048, Ex Comp 32 | US9108973, 32
Type:
Small organic molecule
Emp. Form.:
C24H22N6O3
Mol. Mass.:
442.4699
SMILES:
COc1cc(OC)cc(c1)C#Cc1nn([C@H]2C[C@@H](C#C)N(C2)C(=O)C=C)c2ncnc(N)c12
: