Target
Vascular endothelial growth factor receptor 2
Ligand
BDBM7245
Substrate
poly(E:Y)
Meas. Tech.
CDK Assay
Temperature
298.15±n/a K
IC50
10000±n/a nM
Comments
extracted
Citation
 Li, XHuang, PCui, JJZhang, JTang, C Novel pyrrolyllactone and pyrrolyllactam indolinones as potent cyclin-dependent kinase 2 inhibitors. Bioorg Med Chem Lett 13:1939-42 (2003)  
Target
Name:
Vascular endothelial growth factor receptor 2
Synonyms:
CD_antigen=CD309 Fetal liver kinase 1 (FLK-1) KDR Protein-tyrosine kinase receptor Flk-1 VEGFR-2 VEGFR2 Vascular Endothelial Growth Factor Receptor Kinase 2 Vascular endothelial growth factor receptor 2 (KDR) Vascular endothelial growth factor receptor 2 (VEGFR2) Vascular endothelial growth factor receptor-2 (VEGFR-2)
Type:
Receptor Tyrosine Kinase
Mol. Mass.:
151510.97
Organism:
Homo sapiens (Human)
Description:
P35968
Residue:
1356
  
Inhibitor
Name:
BDBM7245
Synonyms:
(3Z)-5-fluoro-3-({4-oxo-2H,4H,6H,7H-pyrano[3,4-c]pyrrol-1-yl}methylidene)-2,3-dihydro-1H-indol-2-one | pyrrollylactone indolinone driv. 15g
Type:
Small organic molecule
Emp. Form.:
C16H11FN2O3
Mol. Mass.:
298.2685
SMILES:
Fc1ccc2NC(=O)\C(=C/c3[nH]cc4c3CCOC4=O)c2c1
:
Substrate
Name:
poly(E:Y)
Synonyms:
Type:
Random Polymer
Mol. Mass.:
358.43
Organism:
Description:
a polyGlu-Tyr peptide (4:1)(Sigma P-0275). 10 uM ATP as co-substrate.
Residue:
3
NA