Target
Platelet-derived growth factor receptor beta
Ligand
BDBM7251
Substrate
VEGF-receptor 2 and PDGF-receptor beta (KDR and PDGFR beta)
Meas. Tech.
CDK Assay
Temperature
298.15±n/a K
IC50
1400±n/a nM
Comments
extracted
Citation
 Li, XHuang, PCui, JJZhang, JTang, C Novel pyrrolyllactone and pyrrolyllactam indolinones as potent cyclin-dependent kinase 2 inhibitors. Bioorg Med Chem Lett 13:1939-42 (2003)  
Target
Name:
Platelet-derived growth factor receptor beta
Synonyms:
Beta-type platelet-derived growth factor receptor CD140b antigen PDGF Receptor Substrate PDGFR PDGFR-1 PDGFRB PGFRB_HUMAN Platelet-derived growth factor receptor 1 Platelet-derived growth factor receptor beta (PDGFR-beta) Platelet-derived growth factor receptor beta (PDGFRbeta) | VHL/PDGFRB
Type:
Enzyme
Mol. Mass.:
123922.25
Organism:
Homo sapiens (Human)
Description:
P09619
Residue:
1106
  
Inhibitor
Name:
BDBM7251
Synonyms:
(3Z)-6-methoxy-3-({4-oxo-2H,4H,6H,7H-pyrano[3,4-c]pyrrol-1-yl}methylidene)-2,3-dihydro-1H-indol-2-one | pyrrollylactone indolinone driv. 15m
Type:
Small organic molecule
Emp. Form.:
C17H14N2O4
Mol. Mass.:
310.3041
SMILES:
COc1ccc2\C(=C\c3[nH]cc4c3CCOC4=O)C(=O)Nc2c1
:
Substrate
Name:
Platelet-derived growth factor receptor beta
Synonyms:
Beta-type platelet-derived growth factor receptor CD140b antigen PDGF Receptor Substrate PDGFR PDGFR-1 PDGFRB PGFRB_HUMAN Platelet-derived growth factor receptor 1 Platelet-derived growth factor receptor beta (PDGFR-beta) Platelet-derived growth factor receptor beta (PDGFRbeta) | VHL/PDGFRB
Type:
Enzyme
Mol. Mass.:
123922.25
Organism:
Homo sapiens (Human)
Description:
P09619
Residue:
1106