Target
Replicase polyprotein 1ab
Ligand
BDBM429505
Substrate
Meas. Tech.
Antiviral Assay using MTT
EC50
1100±200 nM
Citation
 Zhang, CHStone, EADeshmukh, MIppolito, JAGhahremanpour, MMTirado-Rives, JSpasov, KAZhang, STakeo, YKudalkar, SNLiang, ZIsaacs, FLindenbach, BMiller, SJAnderson, KSJorgensen, WL Potent Noncovalent Inhibitors of the Main Protease of SARS-CoV-2 from Molecular Sculpting of the Drug Perampanel Guided by Free Energy Perturbation Calculations ACS Cent Sci 0:0 (2021)    Article 
Target
Name:
Replicase polyprotein 1ab
Synonyms:
ORF1ab polyprotein pp1ab | rep
Type:
Protein
Mol. Mass.:
794070.71
Organism:
2019-nCoV
Description:
P0DTD1
Residue:
7096
  
Inhibitor
Name:
BDBM429505
Synonyms:
Remdesivir | med.21724, Compound 178
Type:
Small Organic Molecule
Emp. Form.:
C27H35N6O8P
Mol. Mass.:
602.576
SMILES:
CCC(CC)COC(=O)[C@H](C)N[P@](=O)(OC[C@H]1O[C@](C#N)([C@H](O)[C@@H]1O)c1ccc2c(N)ncnn12)Oc1ccccc1
: