Target
Serine/threonine-protein kinase B-raf [V600E]
Ligand
BDBM86389
Substrate
Meas. Tech.
In Vitro Activity Assay
IC50
2.90±n/a nM
Citation
 Aversa, RJBarsanti, PABurger, MTDillon, MPDipesa, AHu, CLou, YNishiguchi, GAPan, YPolyakov, VRRamurthy, SRico, ACSetti, LQSmith, ASubramanian, STaft, BRTanner, HRWan, LYusuff, N Biaryl amide compounds as kinase inhibitors US Patent  US10709712 Publication Date 7/14/2020 
Target
Name:
Serine/threonine-protein kinase B-raf [V600E]
Synonyms:
B-RAF V600E B-Raf Protein Kinase Mutant (V600E) BRAF BRAF mutant V600E BRAF_HUMAN Protein mono-ADP-ribosyltransferase (PARP3) RAFB1 Serine/threonine-protein kinase B-raf (V600E) V-RAF murine sarcoma viral oncogene homologue B1 mutant (BRAF V600E)
Type:
Mol. Mass.:
84474.98
Organism:
Homo sapiens (Human)
Description:
P15056 V600E
Residue:
766
  
Inhibitor
Name:
BDBM86389
Synonyms:
US10245267, Example 664 US9694016, 664
Type:
Small organic molecule
Emp. Form.:
C25H27F2N5O3
Mol. Mass.:
483.5104
SMILES:
C[C@H]1COCCN1c1cc(nn(C)c1=O)-c1cc(NC(=O)c2ccnc(c2)C(C)(F)F)ccc1C
: