Target
cAMP-specific 3',5'-cyclic phosphodiesterase 4B [122-736]
Ligand
BDBM399978
Substrate
Meas. Tech.
Scintillation Proximity Assay (SPA)
IC50
5.66±n/a nM
Citation
 Chappie, TAPatel, NCVerhoest, PRHelal, CJSciabola, SLaChapelle, EAWager, TTHayward, MM 6,7-dihydro-5H-pyrazolo[5,1-b][1,3]oxazine-2-carboxamide compounds US Patent  US10738063 Publication Date 8/11/2020 
Target
Name:
cAMP-specific 3',5'-cyclic phosphodiesterase 4B [122-736]
Synonyms:
DPDE4 PDE4B_HUMAN | cAMP-specific 3',5'-cyclic phosphodiesterase 4B1 (PDE4B)(122-736)
Type:
Enzyme Catalytic Domain
Mol. Mass.:
70260.82
Organism:
Homo sapiens (Human)
Description:
aa 122 to 736
Residue:
615
  
Inhibitor
Name:
BDBM399978
Synonyms:
US10323042, Example 57 | US10738063, Example 57
Type:
Small organic molecule
Emp. Form.:
C17H16ClF2N3O2
Mol. Mass.:
367.778
SMILES:
Cc1cc(Cl)c(F)cc1-c1c(nn2C[C@H](F)COc12)C(=O)NC1CC1
: