Target
Tyrosine-protein kinase Tec
Ligand
BDBM50458601
Substrate
Meas. Tech.
Kinase Inhibition Assay
IC50
0.100±n/a nM
Citation
 Laurent, AMorris, SJ Spirocyclic containing compounds and pharmaceutical uses thereof US Patent  US10752615 Publication Date 8/25/2020 
Target
Name:
Tyrosine-protein kinase Tec
Synonyms:
PSCTK4 TEC_HUMAN | Tyrosine-protein kinase TEC (TEC)
Type:
Protein
Mol. Mass.:
73597.00
Organism:
Homo sapiens (Human)
Description:
Residue:
631
  
Inhibitor
Name:
BDBM50458601
Synonyms:
CHEMBL4217959 | US10752615, Compound 138
Type:
Small organic molecule
Emp. Form.:
C26H25N7O2S
Mol. Mass.:
499.587
SMILES:
Nc1nccc(n1)-c1ccc(s1)C(=O)Nc1nc2ccccc2n1[C@H]1C[C@]2(C1)CCN(C2)C(=O)C=C
: