Target
P2X purinoceptor 7
Ligand
BDBM242040
Substrate
Meas. Tech.
Binding Assay
IC50
0.60±n/a nM
Citation
 Kilburn, JPRasmussen, LKJessing, MEldemenky, EMChen, BJiang, Y Cyclic amines US Patent  US9593105 Publication Date 3/14/2017 
Target
Name:
P2X purinoceptor 7
Synonyms:
ATP receptor P2RX7_HUMAN P2X purinoceptor 7 (P2X7) P2Z receptor | Purinergic receptor
Type:
Protein
Mol. Mass.:
68602.85
Organism:
Homo sapiens (Human)
Description:
Q99572
Residue:
595
  
Inhibitor
Name:
BDBM242040
Synonyms:
US9415055, 2,3-dichloro-N-[2-(4,4-difluoro-1-piperidyl)-2-(4-methoxyphenyl)ethyl]benzamide | US9593105, 41
Type:
Small organic molecule
Emp. Form.:
C21H22Cl2F2N2O2
Mol. Mass.:
443.314
SMILES:
COc1ccc(cc1)C(CNC(=O)c1cccc(Cl)c1Cl)N1CCC(F)(F)CC1
: