Target
P2X purinoceptor 7
Ligand
BDBM242220
Substrate
Meas. Tech.
Binding Assay
IC50
2.30±n/a nM
Citation
 Kilburn, JPRasmussen, LKJessing, MEldemenky, EMChen, BJiang, Y Cyclic amines US Patent  US9593105 Publication Date 3/14/2017 
Target
Name:
P2X purinoceptor 7
Synonyms:
ATP receptor P2RX7_HUMAN P2X purinoceptor 7 (P2X7) P2Z receptor | Purinergic receptor
Type:
Protein
Mol. Mass.:
68602.85
Organism:
Homo sapiens (Human)
Description:
Q99572
Residue:
595
  
Inhibitor
Name:
BDBM242220
Synonyms:
US9415055, (+)2-chloro-N-[2-[6-(difluoromethyl)-3-pyridyl]-2-(4,4-difluoro-1-piperidyl)ethyl]-3-methoxy-benzamide | US9593105, 222
Type:
Small organic molecule
Emp. Form.:
C21H22ClF4N3O2
Mol. Mass.:
459.865
SMILES:
COc1cccc(C(=O)NCC(N2CCC(F)(F)CC2)c2ccc(nc2)C(F)F)c1Cl
: