Target
Neprilysin
Ligand
BDBM299630
Substrate
Meas. Tech.
Enzyme Inhibition Assay
Ki
<1.00±n/a nM
Citation
 Fleury, MBeausoliel, AHughes, ADLong, DDWilton, DA Neprilysin inhibitors US Patent  US9593110 Publication Date 3/14/2017 
Target
Name:
Neprilysin
Synonyms:
Atriopeptidase CD_antigen=CD10 EPN MME NEP_HUMAN Neutral endopeptidase | Neutral endopeptidase 24.11
Type:
Enzyme
Mol. Mass.:
85505.38
Organism:
Homo sapiens (Human)
Description:
P08473
Residue:
750
  
Inhibitor
Name:
BDBM299630
Synonyms:
(2S,4S)-5-(5′-Chloro-2′-fluorobiphenyl-4-yl)-2-[(2-fluoroethylamino)methyl]-4-[(3H-[1,2,3]triazole-4-carbonyl)amino]pentanoic Acid US9593110, Example 82a US9593110, Example 84b | US9593110, Example 85a
Type:
Small organic molecule
Emp. Form.:
C28H32BClFNO6S
Mol. Mass.:
575.884
SMILES:
CCOC(=O)[C@H](COS(=O)(=O)c1ccc(C)cc1)C[C@@H](Cc1ccc(cc1)-c1cc(Cl)ccc1F)NB(C)O
: