Target
Neprilysin
Ligand
BDBM300297
Substrate
Meas. Tech.
Enzyme Inhibition Assay
Ki
<1.00±n/a nM
Citation
 Fleury, MBeausoliel, AHughes, ADLong, DDWilton, DA Neprilysin inhibitors US Patent  US9593110 Publication Date 3/14/2017 
Target
Name:
Neprilysin
Synonyms:
Atriopeptidase CD_antigen=CD10 EPN MME NEP_HUMAN Neutral endopeptidase | Neutral endopeptidase 24.11
Type:
Enzyme
Mol. Mass.:
85505.38
Organism:
Homo sapiens (Human)
Description:
P08473
Residue:
750
  
Inhibitor
Name:
BDBM300297
Synonyms:
US9593110, 7-5
Type:
Small Organic Molecule
Emp. Form.:
C26H28ClFN2O5
Mol. Mass.:
502.962
SMILES:
CCOC[C@H](C[C@@H](Cc1ccc(cc1)-c1cc(Cl)ccc1F)NC(=O)c1cc(CC)no1)C(O)=O
: