Target
Neprilysin
Ligand
BDBM300311
Substrate
Meas. Tech.
Enzyme Inhibition Assay
Ki
<1.00±n/a nM
Citation
 Fleury, MBeausoliel, AHughes, ADLong, DDWilton, DA Neprilysin inhibitors US Patent  US9593110 Publication Date 3/14/2017 
Target
Name:
Neprilysin
Synonyms:
Atriopeptidase CD_antigen=CD10 EPN MME NEP_HUMAN Neutral endopeptidase | Neutral endopeptidase 24.11
Type:
Enzyme
Mol. Mass.:
85505.38
Organism:
Homo sapiens (Human)
Description:
P08473
Residue:
750
  
Inhibitor
Name:
BDBM300311
Synonyms:
US9593110, 30-2
Type:
Small Organic Molecule
Emp. Form.:
C25H24ClFN4O6
Mol. Mass.:
530.933
SMILES:
COC(=O)N[C@H](C[C@@H](Cc1ccc(cc1)-c1cc(Cl)ccc1F)NC(=O)c1cc(n[nH]1)C(C)=O)C(O)=O
: