Target
Neprilysin
Ligand
BDBM300317
Substrate
Meas. Tech.
Enzyme Inhibition Assay
Ki
<1.00±n/a nM
Citation
 Fleury, MBeausoliel, AHughes, ADLong, DDWilton, DA Neprilysin inhibitors US Patent  US9593110 Publication Date 3/14/2017 
Target
Name:
Neprilysin
Synonyms:
Atriopeptidase CD_antigen=CD10 EPN MME NEP_HUMAN Neutral endopeptidase | Neutral endopeptidase 24.11
Type:
Enzyme
Mol. Mass.:
85505.38
Organism:
Homo sapiens (Human)
Description:
P08473
Residue:
750
  
Inhibitor
Name:
BDBM300317
Synonyms:
US9593110, 30-6
Type:
Small Organic Molecule
Emp. Form.:
C25H25ClFN3O6
Mol. Mass.:
517.934
SMILES:
CCc1nc(co1)C(=O)N[C@@H](C[C@@H](NC(=O)OC)C(O)=O)Cc1ccc(cc1)-c1cc(Cl)ccc1F
: