Target
Neprilysin
Ligand
BDBM300342
Substrate
Meas. Tech.
Enzyme Inhibition Assay
Ki
<1.00±n/a nM
Citation
 Fleury, MBeausoliel, AHughes, ADLong, DDWilton, DA Neprilysin inhibitors US Patent  US9593110 Publication Date 3/14/2017 
Target
Name:
Neprilysin
Synonyms:
Atriopeptidase CD_antigen=CD10 EPN MME NEP_HUMAN Neutral endopeptidase | Neutral endopeptidase 24.11
Type:
Enzyme
Mol. Mass.:
85505.38
Organism:
Homo sapiens (Human)
Description:
P08473
Residue:
750
  
Inhibitor
Name:
BDBM300342
Synonyms:
US9593110, 16-18
Type:
Small Organic Molecule
Emp. Form.:
C24H25ClFN5O4
Mol. Mass.:
501.938
SMILES:
CN(C)C(=O)c1cc([nH]n1)C(=O)N[C@@H](C[C@@H](N)C(O)=O)Cc1ccc(cc1)-c1cc(Cl)ccc1F
: