Target
Tyrosine-protein kinase receptor UFO
Ligand
BDBM299996
Substrate
Meas. Tech.
Enzyme Assay
Ki
0.021±n/a nM
Citation
 Johnson, TWRichardson, PFCollins, MRRichter, DTBurke, BJNinkovic, SGajiwala, KSLinton, MALe, PTHoffman, JE Axl inhibitors US Patent  US9593097 Publication Date 3/14/2017 
Target
Name:
Tyrosine-protein kinase receptor UFO
Synonyms:
AXL TEL/AXL UFO | UFO_HUMAN
Type:
Enzyme
Mol. Mass.:
98316.97
Organism:
Homo sapiens (Human)
Description:
P30530
Residue:
894
  
Inhibitor
Name:
BDBM299996
Synonyms:
4-[(1- cyanocyclopropyl) methoxy]-6-[4-(4- methoxy-1H- pyrrolo[2,3- b]pyridin-3- yl)piperidin-1-yl]- N-[(2S)-1,1,1- trifluoropropan-2- yl]-1,3,5-triazine- 2-carboxamide | US9593097, Example 367
Type:
Small organic molecule
Emp. Form.:
C25H27F3N8O3
Mol. Mass.:
544.5289
SMILES:
COc1ccnc2[nH]cc(C3CCN(CC3)c3nc(OCC4(CC4)C#N)nc(n3)C(=O)N[C@@H](C)C(F)(F)F)c12
: