Target
Cyclin-dependent kinase 5 activator 1 [99-307]
Ligand
BDBM7402
Substrate
Histone H1
Meas. Tech.
Kinase Inhibition Assay
Temperature
303.15±n/a K
IC50
2400±n/a nM
Comments
extracted
Citation
 Polychronopoulos, PMagiatis, PSkaltsounis, ALMyrianthopoulos, VMikros, ETarricone, AMusacchio, ARoe, SMPearl, LLeost, MGreengard, PMeijer, L Structural basis for the synthesis of indirubins as potent and selective inhibitors of glycogen synthase kinase-3 and cyclin-dependent kinases. J Med Chem 47:935-46 (2004)  
Target
Name:
Cyclin-dependent kinase 5 activator 1 [99-307]
Synonyms:
CDK5/p25 | Cyclin-Dependent Kinase 5 (CDK5)
Type:
Protein Complex
Mol. Mass.:
Description:
Components:
This complex has 2 components.
Component 1
Name:
Cyclin-dependent kinase 5
Synonyms:
CDK5 CDKN5 Cyclin-dependent kinase 5 (CDK5/ p25) Cyclin-dependent-like kinase 5 PSSALRE Tau protein kinase II catalytic subunit
Type:
Enzyme Subunit
Mol. Mass.:
33308.61
Organism:
Homo sapiens (Human)
Description:
Residue:
292
  
Component 2
Name:
Cyclin-dependent kinase 5 activator 1 [99-307]
Synonyms:
CD5R1_HUMAN CDK5R1 Cyclin-dependent kinase 5 activator 1, p25 TPKII regulatory subunit | p25
Type:
Enzyme Subunit
Mol. Mass.:
23250.56
Organism:
Homo sapiens (Human)
Description:
Q15078 aa 99-307
Residue:
209
  
Inhibitor
Name:
BDBM7402
Synonyms:
(2 Z,3 E)-6-Bromoindirubin-3 -acetoxime [(3E)-2-[(3Z)-6-bromo-2-oxo-2,3-dihydro-1H-indol-3-ylidene]-2,3-dihydro-1H-indol-3-ylidene]amino acetate | indirubin deriv. 8a
Type:
Small organic molecule
Emp. Form.:
C18H12BrN3O3
Mol. Mass.:
398.21
SMILES:
CC(=O)ON=C1C(Nc2ccccc12)=C1C(=O)Nc2cc(Br)ccc12
:
Substrate
Name:
Histone H1
Synonyms:
Type:
Other Protein Type
Mol. Mass.:
358.43
Organism:
Bos taurus (bovine)
Description:
Residue:
3
NA