Target
Glycogen synthase kinase-3 beta
Ligand
BDBM7394
Substrate
GSK-3 Peptide Substrate
Meas. Tech.
Kinase Inhibition Assay
Temperature
303.15±n/a K
IC50
200±n/a nM
Comments
extracted
Citation
 Polychronopoulos, PMagiatis, PSkaltsounis, ALMyrianthopoulos, VMikros, ETarricone, AMusacchio, ARoe, SMPearl, LLeost, MGreengard, PMeijer, L Structural basis for the synthesis of indirubins as potent and selective inhibitors of glycogen synthase kinase-3 and cyclin-dependent kinases. J Med Chem 47:935-46 (2004)  
Target
Name:
Glycogen synthase kinase-3 beta
Synonyms:
GSK-3 alpha/beta | Glycogen Synthase Kinase-3, beta
Type:
Enzyme Mixture
Mol. Mass.:
48062.20
Organism:
Porcine
Description:
Purification of GSK-3 alpha and GSK-3 beta from Porcine Brain on Axin-Sepharose. Porcine brains were obtained from a local slaughter and directly homogenized and processed for affinity chromatography.
Residue:
433
  
Inhibitor
Name:
BDBM7394
Synonyms:
(2 Z,3 E)-Indirubin-3 -acetoxime indirubin deriv. 8h | indirubin-3 -acetoxime
Type:
Small organic molecule
Emp. Form.:
C18H13N3O3
Mol. Mass.:
319.3141
SMILES:
CC(=O)ON=C1C(Nc2ccccc12)=C1C(=O)Nc2ccccc12
:
Substrate
Name:
GSK-3 Peptide Substrate
Synonyms:
GS-1 Peptide | Phospho-GS2 Substrate Peptide
Type:
Peptide
Mol. Mass.:
3045.17
Organism:
Description:
Residue:
27