Target
NADPH oxidase 1
Ligand
BDBM299743
Substrate
Meas. Tech.
ROS Production Measurement on hNOX1 Membranes
Ki
29.0±n/a nM
Citation
 Machin, PSharpe, ALock, CJChambers, MSHodges, AAllen, VEllard, JM Amido thiadiazole derivatives as NADPH oxidase inhibitors US Patent  US10130619 Publication Date 11/20/2018 
Target
Name:
NADPH oxidase 1
Synonyms:
MOX-1 Mitogenic oxidase 1 NOH-1 NOX-1 NOX1_HUMAN
Type:
PROTEIN
Mol. Mass.:
64890.44
Organism:
Homo sapiens (Human)
Description:
ChEMBL_792877
Residue:
564
  
Inhibitor
Name:
BDBM299743
Synonyms:
US10130619, Example 9
Type:
Small organic molecule
Emp. Form.:
C28H29N5O3S
Mol. Mass.:
515.627
SMILES:
COc1cc(ccc1O[C@@H](CCN1CCCC1)c1ccccc1)C(=O)Nc1nnc(s1)-c1ccncc1
: