Target
Fibroblast growth factor receptor 2
Ligand
BDBM161389
Substrate
Meas. Tech.
Measurement of Inhibitory Effect on FGFR2 Kinase Activity
IC50
1.10±n/a nM
Citation
 Sootome, H Therapeutic agent for FGFR inhibitor-resistant cancer US Patent  US10835536 Publication Date 11/17/2020 
Target
Name:
Fibroblast growth factor receptor 2
Synonyms:
BEK FGFR-2 FGFR2 Fibroblast growth factor receptor 2 (FGFR2) KGFR Keratinocyte growth factor receptor VEGF-receptor 2 and Fibroblast growth factor receptor 2
Type:
Enzyme
Mol. Mass.:
92015.45
Organism:
Homo sapiens (Human)
Description:
P21802
Residue:
821
  
Inhibitor
Name:
BDBM161389
Synonyms:
US10124003, Ref. Ex. Compound 3 US10894048, Ex Comp 2 | US9108973, 2
Type:
Small organic molecule
Emp. Form.:
C22H22N6O3
Mol. Mass.:
418.4485
SMILES:
COc1cc(OC)cc(c1)C#Cc1nn([C@H]2CCN(C2)C(=O)C=C)c2ncnc(N)c12
: