Target
Tyrosine-protein kinase JAK2
Ligand
BDBM333120
Substrate
Meas. Tech.
Biochemical Kinase Assay
Ki
0.016±n/a nM
Citation
 Colson, PFass, GT Process for preparing JAK inhibitors and intermediates thereof US Patent  US10844057 Publication Date 11/24/2020 
Target
Name:
Tyrosine-protein kinase JAK2
Synonyms:
JAK-2 JAK2_HUMAN Janus kinase 2 (JAK2) | Janus kinase 2 (a protein tyrosine kinase)
Type:
Protein
Mol. Mass.:
130684.68
Organism:
Homo sapiens (Human)
Description:
O60674
Residue:
1132
  
Inhibitor
Name:
BDBM333120
Synonyms:
(S)-(3-(dimethylamino)azetidin-1-yl)(2-(6-(2-ethyl-5-fluoro-4-hydroxyphenyl)-1H-indazol-3-yl)-5-isopropyl-4,5,6,7-tetrahydro-3H-imidazo[4,5-c]pyridin-6-yl)methanone US10550118, Example 8-7 US10947229, Example C-1 US11634419, Example C-1 | US11702415, Compound C-1
Type:
Small organic molecule
Emp. Form.:
C30H36FN7O2
Mol. Mass.:
545.6509
SMILES:
CCc1cc(O)c(F)cc1-c1ccc2c(n[nH]c2c1)-c1nc2C[C@H](N(Cc2[nH]1)C(C)C)C(=O)N1CC(C1)N(C)C
: