Target
Adenosine receptor A2b
Ligand
BDBM474284
Substrate
Meas. Tech.
FLIPR and cAMP Inhibition Assay
IC50
4.69±n/a nM
Citation
 Zeng, QQi, CTsui, HYang, ZZhang, X Triazolo-pyrimidine compounds and uses thereof US Patent  US10858365 Publication Date 12/8/2020 
Target
Name:
Adenosine receptor A2b
Synonyms:
AA2BR_HUMAN ADORA2B Adenosine receptors A2b | Adenosine receptors; A2a & A2b
Type:
G Protein-Coupled Receptor (GPCR)
Mol. Mass.:
36341.22
Organism:
Homo sapiens (Human)
Description:
Residue:
332
  
Inhibitor
Name:
BDBM474284
Synonyms:
7-(4-fluorophenyl)-2-((3-fluoropyridin-2-yl) methyl)-8-(1-methyl-1H-benzo[d]imidazol-6-yl)-[1,2, 4]triazolo[l,5-c]pyrimidin-5-amine | US10858365, Compound 69
Type:
Small organic molecule
Emp. Form.:
C25H18F2N8
Mol. Mass.:
468.4608
SMILES:
Cn1cnc2ccc(cc12)-c1c(nc(N)n2nc(Cc3ncccc3F)nc12)-c1ccc(F)cc1
: