Target
Protein Wnt-3a
Ligand
BDBM300512
Substrate
Meas. Tech.
HCT116 FOPFlash
IC50
>50000±n/a nM
Comments
0.000 12/22/2021
Citation
 Thede, KScott, WBender, EGolz, SHägebarth, ALienau, PPuehler, FBasting, DSchneider, DMöwes, MRichter, AZorn, LLiu, NMönning, USiegel, F Compounds US Patent  US10130633 Publication Date 11/20/2018 
Target
Name:
Protein Wnt-3a
Synonyms:
WNT3A | WNT3A_HUMAN
Type:
PROTEIN
Mol. Mass.:
39379.02
Organism:
Homo sapiens (Human)
Description:
ChEMBL_1469237
Residue:
352
  
Inhibitor
Name:
BDBM300512
Synonyms:
N-[6-(2-fluorophenyl)pyridin-3-yl]-4-methoxy-3-({[1-(morpholin-4-yl)cyclobutyl]carbonyl}amino)benzamide | US10130633, Example 82
Type:
Small organic molecule
Emp. Form.:
C28H29FN4O4
Mol. Mass.:
504.5527
SMILES:
COc1ccc(cc1NC(=O)C1(CCC1)N1CCOCC1)C(=O)Nc1ccc(nc1)-c1ccccc1F
: