Target
Neprilysin
Ligand
BDBM300712
Substrate
Meas. Tech.
Enzyme Inhibition Assays
Ki
<1.000±n/a nM
Citation
 Fleury, MGendron, RHughes, AD Neprilysin inhibitors US Patent  US10130642 Publication Date 11/20/2018 
Target
Name:
Neprilysin
Synonyms:
Atriopeptidase CD_antigen=CD10 EPN MME NEP_HUMAN Neutral endopeptidase | Neutral endopeptidase 24.11
Type:
Enzyme
Mol. Mass.:
85505.38
Organism:
Homo sapiens (Human)
Description:
P08473
Residue:
750
  
Inhibitor
Name:
BDBM300712
Synonyms:
US10130642, Example 4-8
Type:
Small organic molecule
Emp. Form.:
C21H21FN4O5
Mol. Mass.:
428.4136
SMILES:
OCC(CC(Cc1ccc(cc1)-c1ccccc1F)NC(=O)c1cn(O)nn1)C(O)=O
: