Target
Fibroblast growth factor receptor 2
Ligand
BDBM478136
Substrate
Meas. Tech.
Measurement of Inhibitory Effect on FGFR2 Kinase Activity
IC50
0.600±n/a nM
Citation
 Ochiiwa, HHirai, H Antitumor drug for intermittent administration of FGFR inhibitor US Patent  US10894048 Publication Date 1/19/2021 
Target
Name:
Fibroblast growth factor receptor 2
Synonyms:
BEK FGFR-2 FGFR2 Fibroblast growth factor receptor 2 (FGFR2) KGFR Keratinocyte growth factor receptor VEGF-receptor 2 and Fibroblast growth factor receptor 2
Type:
Enzyme
Mol. Mass.:
92015.45
Organism:
Homo sapiens (Human)
Description:
P21802
Residue:
821
  
Inhibitor
Name:
BDBM478136
Synonyms:
US10894048, Ex Comp 53
Type:
Small organic molecule
Emp. Form.:
C26H29N7O3
Mol. Mass.:
487.5536
SMILES:
COc1cc(OC)cc(c1)C#Cc1nn(C2CN(C2)C(=O)\C=C\CN2CCCC2)c2ncnc(N)c12
: