Target
Lysine-specific histone demethylase 1A
Ligand
BDBM301014
Substrate
Meas. Tech.
In Vitro Enzyme Inhibition Assay - LSD-1
IC50
<10±n/a nM
Citation
 Chen, YKKanouni, TKaldor, SWStafford, JAVeal, JM Inhibitors of lysine specific demethylase-1 US Patent  US10131664 Publication Date 11/20/2018 
Target
Name:
Lysine-specific histone demethylase 1A
Synonyms:
AOF2 Flavin-containing amine oxidase domain-containing protein 2 KDM1A KIAA0601 Lysine-specific demethylase 1 (LSD1) Lysine-specific histone demethylase 1 (LSD1)
Type:
Enzyme
Mol. Mass.:
92901.01
Organism:
Homo sapiens (Human)
Description:
O60341
Residue:
852
  
Inhibitor
Name:
BDBM301014
Synonyms:
4-[5-morpholin-4-yl-1-[[(3S)- pyrrolidin-3-yl]methyl]pyrrolo[3,2- b]pyridin-6-yl]benzonitrile US10543198, Example 7 | US10864202, Example 7
Type:
Small organic molecule
Emp. Form.:
C23H25N5O
Mol. Mass.:
387.4775
SMILES:
N#Cc1ccc(cc1)-c1cc2n(C[C@H]3CCNC3)ccc2nc1N1CCOCC1
: