Target
Lysine-specific histone demethylase 1A
Ligand
BDBM301017
Substrate
Meas. Tech.
In Vitro Enzyme Inhibition Assay - LSD-1
IC50
<10±n/a nM
Citation
 Chen, YKKanouni, TKaldor, SWStafford, JAVeal, JM Inhibitors of lysine specific demethylase-1 US Patent  US10131664 Publication Date 11/20/2018 
Target
Name:
Lysine-specific histone demethylase 1A
Synonyms:
AOF2 Flavin-containing amine oxidase domain-containing protein 2 KDM1A KIAA0601 Lysine-specific demethylase 1 (LSD1) Lysine-specific histone demethylase 1 (LSD1)
Type:
Enzyme
Mol. Mass.:
92901.01
Organism:
Homo sapiens (Human)
Description:
O60341
Residue:
852
  
Inhibitor
Name:
BDBM301017
Synonyms:
4-[5-(4-methylphenyl)-1-[[(2R)- morpholin-2-yl]methyl]pyrrolo[3,2- b]pyridin-6-yl]benzonitrile US10543198, Example 10 | US10864202, Example 10
Type:
Small organic molecule
Emp. Form.:
C26H24N4O
Mol. Mass.:
408.495
SMILES:
Cc1ccc(cc1)-c1nc2ccn(C[C@H]3CNCCO3)c2cc1-c1ccc(cc1)C#N
: