Target
Lysine-specific histone demethylase 1A
Ligand
BDBM301096
Substrate
Meas. Tech.
In Vitro Enzyme Inhibition Assay - LSD-1
IC50
<10±n/a nM
Citation
 Chen, YKKanouni, TKaldor, SWStafford, JAVeal, JM Inhibitors of lysine specific demethylase-1 US Patent  US10131664 Publication Date 11/20/2018 
Target
Name:
Lysine-specific histone demethylase 1A
Synonyms:
AOF2 Flavin-containing amine oxidase domain-containing protein 2 KDM1A KIAA0601 Lysine-specific demethylase 1 (LSD1) Lysine-specific histone demethylase 1 (LSD1)
Type:
Enzyme
Mol. Mass.:
92901.01
Organism:
Homo sapiens (Human)
Description:
O60341
Residue:
852
  
Inhibitor
Name:
BDBM301096
Synonyms:
2-fluoro-4-[2-[4- (methylamino)piperidin-1-yl]-5-[1- (2,2,2-trifluoroethyl)pyrazol-4- yl]pyrimidin-4-yl]benzonitrile | US10131664, Example 89
Type:
Small organic molecule
Emp. Form.:
C22H21F4N7
Mol. Mass.:
459.4427
SMILES:
CNC1CCN(CC1)c1ncc(-c2cnn(CC(F)(F)F)c2)c(n1)-c1ccc(C#N)c(F)c1
: