Target
Cyclin-dependent kinase/G2/mitotic-specific cyclin- 1
Ligand
BDBM7760
Substrate
Peptide Substrate
Meas. Tech.
Kinase Inhibition SPA Assay
IC50
45±n/a nM
Citation
 Bramson, HNCorona, JDavis, STDickerson, SHEdelstein, MFrye, SVGampe, RTHarris, PAHassell, AHolmes, WDHunter, RNLackey, KELovejoy, BLuzzio, MJMontana, VRocque, WJRusnak, DShewchuk, LVeal, JMWalker, DHKuyper, LF Oxindole-based inhibitors of cyclin-dependent kinase 2 (CDK2): design, synthesis, enzymatic activities, and X-ray crystallographic analysis. J Med Chem 44:4339-58 (2001)  
Target
Name:
Cyclin-dependent kinase/G2/mitotic-specific cyclin- 1
Synonyms:
CDK1/B CDK1/CyclinB Cyclin-Dependent Kinase 1 (CDK1) Cyclin-dependent kinase/G2/mitotic-specific cyclin 1 | cdk1
Type:
Protein Complex
Mol. Mass.:
Description:
CDK1/Cyclin B complexes were purified from insect cells co-infected with baculovirus vectors containing each of the components.
Components:
This complex has 2 components.
Component 1
Name:
Cyclin-dependent kinase 1
Synonyms:
CDC2 CDK1 CDKN1 Cell division protein kinase 1 P34CDC2 | p34 protein kinase
Type:
Enzyme Subunit
Mol. Mass.:
34101.08
Organism:
Homo sapiens (Human)
Description:
P06493
Residue:
297
  
Component 2
Name:
G2/mitotic-specific cyclin-B1
Synonyms:
CCNB CCNB1_HUMAN
Type:
Enzyme Subunit
Mol. Mass.:
48340.95
Organism:
Homo sapiens (Human)
Description:
P14635
Residue:
433
  
Inhibitor
Name:
BDBM7760
Synonyms:
3-{[4-({[(12Z)-11-oxo-3-thia-5,10-diazatricyclo[7.3.0.0^{2,6}]dodeca-1,4,6,8-tetraen-12-ylidene]methyl}amino)benzene]sulfonyl}guanidine Oxindole-Based Inhibitor 96
Type:
Small organic molecule
Emp. Form.:
C17H14N6O3S2
Mol. Mass.:
414.461
SMILES:
NC(=N)NS(=O)(=O)c1ccc(cc1)N=CC1C(=O)Nc2ccc3ncsc3c12
:
Substrate
Name:
Peptide Substrate
Synonyms:
Type:
Peptide
Mol. Mass.:
5198.94
Organism:
Description:
Residue:
46