Target
Diacylglycerol O-acyltransferase 2
Ligand
BDBM486408
Substrate
Meas. Tech.
DGAT2 Enzymatic Activity Assay
IC50
1.10±n/a nM
Citation
 Shen, DGraham, THJiang, JDing, FTudge, C Indole derivatives useful as inhibitors of diacylglyceride O-acyltransferase 2 US Patent  US10947222 Publication Date 3/16/2021 
Target
Name:
Diacylglycerol O-acyltransferase 2
Synonyms:
ARAT DGAT2 Diacylglycerol O-acyltransferase 2 (DGAT2) Retinol O-fatty-acyltransferase
Type:
Multi-pass membrane protein
Mol. Mass.:
43848.90
Organism:
Homo sapiens (Human)
Description:
Q96PD7
Residue:
388
  
Inhibitor
Name:
BDBM486408
Synonyms:
3-[3-(difluoromethoxy)phenyl]-N- (1,1-dioxidotetrahydrothiophen-3- yl)-1-(4-fluorophenyl)-1H-indole- 6-carboxamide (racemic) | US10947222, Example 39
Type:
Small organic molecule
Emp. Form.:
C26H21F3N2O4S
Mol. Mass.:
514.516
SMILES:
FC(F)Oc1cccc(c1)-c1cn(-c2ccc(F)cc2)c2cc(ccc12)C(=O)NC1CCS(=O)(=O)C1
: